[csw-buildfarm] build8s and build9s inconsistancies

Darin Perusich Darin.Perusich at cognigencorp.com
Wed Apr 8 18:04:14 CEST 2009

I was building a package, amanda, on build8s and everything was going
fine but given that Solaris 8 is no longer supported I figured I'd move
over to the Solaris 9 build machines. The code compiles fine but the
staging of the package is incomplete on build9s, whether I use
'stagepkg' or 'gmake DESTDIR=$PWD/cswstage install' the results are the

The staging fails when setting permission, see below, on some of the
binaries and I have no idea why. I compared the CSW packages and they
are identical on both machine so I'm wondering if its something in the OS.

Has anyone else run across this before?

gmake[5]: Entering directory `/home/darin/build/amanda-2.6.1/common-src'
chown darin:sys
chown: /home/darin/build/amanda-2.6.1/cswstage/opt/csw/sbin/amgpgcrypt:
Not owner
gmake[5]: *** [installperms-data] Error 1
gmake[5]: Leaving directory `/home/darin/build/amanda-2.6.1/common-src'
gmake[4]: *** [install-data-am] Error 2
gmake[4]: Leaving directory `/home/darin/build/amanda-2.6.1/common-src'
gmake[3]: *** [install-am] Error 2
gmake[3]: Leaving directory `/home/darin/build/amanda-2.6.1/common-src'
gmake[2]: *** [install] Error 2
gmake[2]: Leaving directory `/home/darin/build/amanda-2.6.1/common-src'
gmake[1]: *** [install-recursive] Error 1
gmake[1]: Leaving directory `/home/darin/build/amanda-2.6.1'
gmake: *** [install] Error 2

Darin Perusich
Unix Systems Administrator
Cognigen Corporation
395 Youngs Rd.
Williamsville, NY 14221
Phone: 716-633-3463
Email: darinper at cognigencorp.com

More information about the buildfarm mailing list